{"text_format":"1","workbook":"xlsx","n_sheets":6,"sheets":["Summary","Totals","Democratic","Republican","Nonpartisan","Instructions"],"not_rendered":{"charts":0,"images":0,"macros":1,"external_links":1,"defined_names":10,"comments":0,"pivot_tables":0},"unopened":[],"bounds":{"document_bytes":16777216,"sheet_cells":100000,"rows_first":2000,"rows_last":500,"rows_between":2000,"halvings":0,"cell_chars":16384,"cell_head_chars":4096},"cells_cut":0,"cells_raw":0,"read":"whole","date_system":"1900"}

{"sheet":"Summary","index":0,"n_rows":15,"n_cols":2,"rows_kept":15,"cut":false,"hidden":false,"merged":[[0,0,0,1],[1,0,1,1],[3,0,3,1],[12,0,12,1]]}
["Ballot Reconciliation"]
["<Insert Election Date and Type>"]
[]
["General Information"]
["Total Number of Precincts",{"$f":"COUNT(IF((Totals[City/Ward/Precinct]<>\"\") * (Totals[City/Ward/Precinct]<>\" - \"), 1))","v":0}]
["Number of Precincts Reconciled",{"$f":"COUNTIF(Totals[Reconciled?], \"YES\")","v":0}]
["Number of Precincts with Discrepancies",{"$f":"COUNTIF(Totals[Reconciled?], \"NO\")","v":0}]
["Percentage of Precincts with Discrepancies",{"$f":" $B$7/IF($B$5 = 0, 1, $B$5)","v":0}]
["Total Number of Ballots Ordered",{"$f":"SUM(Totals[Ballots Ordered])","v":0}]
["Total Number of Ballot Discrepancies",{"$f":"Totals[[#Totals],[Differences]]","v":0}]
{"$rows_left_out":6}
{"sheet":"Totals","index":1,"n_rows":41,"n_cols":11,"rows_kept":41,"cut":false,"hidden":false,"merged":[[0,0,0,10],[1,0,1,10]]}
["Ballot Reconciliation - Totals"]
["Calculated Columns (Do Not Edit)"]
["City/Ward/Precinct","Ballots Ordered","Ballots Used\n(Physically Counted)","Ballots Cast (from Tabulation System)","Unused Ballots","Soiled/ Defaced","Provisional Ballots","Reconciled?","Differences","Absolute Differences","Comments / Explanations"]
[{"$f":"IF(ISBLANK(Democratic!A4), \" - \", Democratic!A4)","v":" - "},{"$f":"SumData()","v":0},0,0,{"$f":"Totals[[#This Row],[Ballots Ordered]]-Totals[[#This Row],[Ballots Used\n(Physically Counted)]]","v":0},{"$f":"SumData()","v":0},0,{"$f":"IF(Totals[[#This Row],[City/Ward/Precinct]]=\" - \", \" - \", IF(Totals[[#This Row],[Differences]]=0,\"YES\",\"NO\"))","v":" - "},{"$f":"Totals[[#This Row],[Ballots Ordered]]-(Totals[[#This Row],[Ballots Cast (from Tabulation System)]]+Totals[[#This Row],[Unused Ballots]]+Totals[[#This Row],[Soiled/ Defaced]]+Totals[[#This Row],[Provisional Ballots]])","v":0},{"$f":"SumData()","v":0},0]
[{"$f":"IF(ISBLANK(Democratic!A5), \" - \", Democratic!A5)","v":" - "},{"$f":"SumData()","v":0},0,0,{"$f":"Totals[[#This Row],[Ballots Ordered]]-Totals[[#This Row],[Ballots Used\n(Physically Counted)]]","v":0},{"$f":"SumData()","v":0},0,{"$f":"IF(Totals[[#This Row],[City/Ward/Precinct]]=\" - \", \" - \", IF(Totals[[#This Row],[Differences]]=0,\"YES\",\"NO\"))","v":" - "},{"$f":"Totals[[#This Row],[Ballots Ordered]]-(Totals[[#This Row],[Ballots Cast (from Tabulation System)]]+Totals[[#This Row],[Unused Ballots]]+Totals[[#This Row],[Soiled/ Defaced]]+Totals[[#This Row],[Provisional Ballots]])","v":0},{"$f":"SumData()","v":0},0]
[{"$f":"IF(ISBLANK(Democratic!A6), \" - \", Democratic!A6)","v":" - "},0,0,0,{"$f":"Totals[[#This Row],[Ballots Ordered]]-Totals[[#This Row],[Ballots Used\n(Physically Counted)]]","v":0},0,0,{"$f":"IF(Totals[[#This Row],[City/Ward/Precinct]]=\" - \", \" - \", IF(Totals[[#This Row],[Differences]]=0,\"YES\",\"NO\"))","v":" - "},{"$f":"Totals[[#This Row],[Ballots Ordered]]-(Totals[[#This Row],[Ballots Cast (from Tabulation System)]]+Totals[[#This Row],[Unused Ballots]]+Totals[[#This Row],[Soiled/ Defaced]]+Totals[[#This Row],[Provisional Ballots]])","v":0},0,0]
[{"$f":"IF(ISBLANK(Democratic!A7), \" - \", Democratic!A7)","v":" - "},0,0,0,{"$f":"Totals[[#This Row],[Ballots Ordered]]-Totals[[#This Row],[Ballots Used\n(Physically Counted)]]","v":0},0,0,{"$f":"IF(Totals[[#This Row],[City/Ward/Precinct]]=\" - \", \" - \", IF(Totals[[#This Row],[Differences]]=0,\"YES\",\"NO\"))","v":" - "},{"$f":"Totals[[#This Row],[Ballots Ordered]]-(Totals[[#This Row],[Ballots Cast (from Tabulation System)]]+Totals[[#This Row],[Unused Ballots]]+Totals[[#This Row],[Soiled/ Defaced]]+Totals[[#This Row],[Provisional Ballots]])","v":0},0,0]
[{"$f":"IF(ISBLANK(Democratic!A8), \" - \", Democratic!A8)","v":" - "},0,0,0,{"$f":"Totals[[#This Row],[Ballots Ordered]]-Totals[[#This Row],[Ballots Used\n(Physically Counted)]]","v":0},0,0,{"$f":"IF(Totals[[#This Row],[City/Ward/Precinct]]=\" - \", \" - \", IF(Totals[[#This Row],[Differences]]=0,\"YES\",\"NO\"))","v":" - "},{"$f":"Totals[[#This Row],[Ballots Ordered]]-(Totals[[#This Row],[Ballots Cast (from Tabulation System)]]+Totals[[#This Row],[Unused Ballots]]+Totals[[#This Row],[Soiled/ Defaced]]+Totals[[#This Row],[Provisional Ballots]])","v":0},0,0]
[{"$f":"IF(ISBLANK(Democratic!A9), \" - \", Democratic!A9)","v":" - "},0,0,0,{"$f":"Totals[[#This Row],[Ballots Ordered]]-Totals[[#This Row],[Ballots Used\n(Physically Counted)]]","v":0},0,0,{"$f":"IF(Totals[[#This Row],[City/Ward/Precinct]]=\" - \", \" - \", IF(Totals[[#This Row],[Differences]]=0,\"YES\",\"NO\"))","v":" - "},{"$f":"Totals[[#This Row],[Ballots Ordered]]-(Totals[[#This Row],[Ballots Cast (from Tabulation System)]]+Totals[[#This Row],[Unused Ballots]]+Totals[[#This Row],[Soiled/ Defaced]]+Totals[[#This Row],[Provisional Ballots]])","v":0},0,0]
[{"$f":"IF(ISBLANK(Democratic!A10), \" - \", Democratic!A10)","v":" - "},0,0,0,{"$f":"Totals[[#This Row],[Ballots Ordered]]-Totals[[#This Row],[Ballots Used\n(Physically Counted)]]","v":0},0,0,{"$f":"IF(Totals[[#This Row],[City/Ward/Precinct]]=\" - \", \" - \", IF(Totals[[#This Row],[Differences]]=0,\"YES\",\"NO\"))","v":" - "},{"$f":"Totals[[#This Row],[Ballots Ordered]]-(Totals[[#This Row],[Ballots Cast (from Tabulation System)]]+Totals[[#This Row],[Unused Ballots]]+Totals[[#This Row],[Soiled/ Defaced]]+Totals[[#This Row],[Provisional Ballots]])","v":0},0,0]
{"$rows_left_out":32}
{"sheet":"Democratic","index":2,"n_rows":41,"n_cols":11,"rows_kept":41,"cut":false,"hidden":false,"merged":[[0,0,0,10],[1,0,1,3],[1,5,1,6],[1,7,1,9]]}
[{"$f":"\"Ballot Reconciliation - \" & MID(CELL(\"filename\",Party1[[#Headers],[City/Ward/Precinct]]),FIND(\"]\",CELL(\"filename\",Party1[[#Headers],[City/Ward/Precinct]]))+1,256)","v":"Ballot Reconciliation - Democratic"}]
["User Editable Columns",null,null,null,"Calculated Columns","User Editable Columns",null,"Calculated Columns (Do Not Edit)",null,null,"User Editable Columns"]
["City/Ward/Precinct","Ballots Ordered","Ballots Used (Physically Counted)","Ballots Cast (from Tabulation System)","Unused Ballots","Soiled/ Defaced","Provisional Ballots","Reconciled?","Difference","Absolute Differences","Comments / Explanations"]
[null,null,null,null,{"$f":"B4-C4","v":0},null,null,{"$f":"IF(ISBLANK(Party1[[#This Row],[City/Ward/Precinct]]), \" - \", IF(Party1[[#This Row],[Difference]]=0,\"YES\",\"NO\"))","v":" - "},{"$f":"Party1[[#This Row],[Ballots Ordered]]-(Party1[[#This Row],[Ballots Cast (from Tabulation System)]]+Party1[[#This Row],[Unused Ballots]]+Party1[[#This Row],[Soiled/ Defaced]]+Party1[[#This Row],[Provisional Ballots]])","v":0},{"$f":"ABS(Party1[[#This Row],[Difference]])","v":0}]
[null,null,null,null,0,null,null,{"$f":"IF(ISBLANK(Party1[[#This Row],[City/Ward/Precinct]]), \" - \", IF(Party1[[#This Row],[Difference]]=0,\"YES\",\"NO\"))","v":" - "},{"$f":"Party1[[#This Row],[Ballots Ordered]]-(Party1[[#This Row],[Ballots Cast (from Tabulation System)]]+Party1[[#This Row],[Unused Ballots]]+Party1[[#This Row],[Soiled/ Defaced]]+Party1[[#This Row],[Provisional Ballots]])","v":0},{"$f":"ABS(Party1[[#This Row],[Difference]])","v":0}]
[null,null,null,null,0,null,null,{"$f":"IF(ISBLANK(Party1[[#This Row],[City/Ward/Precinct]]), \" - \", IF(Party1[[#This Row],[Difference]]=0,\"YES\",\"NO\"))","v":" - "},{"$f":"Party1[[#This Row],[Ballots Ordered]]-(Party1[[#This Row],[Ballots Cast (from Tabulation System)]]+Party1[[#This Row],[Unused Ballots]]+Party1[[#This Row],[Soiled/ Defaced]]+Party1[[#This Row],[Provisional Ballots]])","v":0},{"$f":"ABS(Party1[[#This Row],[Difference]])","v":0}]
[null,null,null,null,0,null,null,{"$f":"IF(ISBLANK(Party1[[#This Row],[City/Ward/Precinct]]), \" - \", IF(Party1[[#This Row],[Difference]]=0,\"YES\",\"NO\"))","v":" - "},{"$f":"Party1[[#This Row],[Ballots Ordered]]-(Party1[[#This Row],[Ballots Cast (from Tabulation System)]]+Party1[[#This Row],[Unused Ballots]]+Party1[[#This Row],[Soiled/ Defaced]]+Party1[[#This Row],[Provisional Ballots]])","v":0},{"$f":"ABS(Party1[[#This Row],[Difference]])","v":0}]
[null,null,null,null,0,null,null,{"$f":"IF(ISBLANK(Party1[[#This Row],[City/Ward/Precinct]]), \" - \", IF(Party1[[#This Row],[Difference]]=0,\"YES\",\"NO\"))","v":" - "},{"$f":"Party1[[#This Row],[Ballots Ordered]]-(Party1[[#This Row],[Ballots Cast (from Tabulation System)]]+Party1[[#This Row],[Unused Ballots]]+Party1[[#This Row],[Soiled/ Defaced]]+Party1[[#This Row],[Provisional Ballots]])","v":0},{"$f":"ABS(Party1[[#This Row],[Difference]])","v":0}]
[null,null,null,null,0,null,null,{"$f":"IF(ISBLANK(Party1[[#This Row],[City/Ward/Precinct]]), \" - \", IF(Party1[[#This Row],[Difference]]=0,\"YES\",\"NO\"))","v":" - "},{"$f":"Party1[[#This Row],[Ballots Ordered]]-(Party1[[#This Row],[Ballots Cast (from Tabulation System)]]+Party1[[#This Row],[Unused Ballots]]+Party1[[#This Row],[Soiled/ Defaced]]+Party1[[#This Row],[Provisional Ballots]])","v":0},{"$f":"ABS(Party1[[#This Row],[Difference]])","v":0}]
[null,null,null,null,0,null,null,{"$f":"IF(ISBLANK(Party1[[#This Row],[City/Ward/Precinct]]), \" - \", IF(Party1[[#This Row],[Difference]]=0,\"YES\",\"NO\"))","v":" - "},{"$f":"Party1[[#This Row],[Ballots Ordered]]-(Party1[[#This Row],[Ballots Cast (from Tabulation System)]]+Party1[[#This Row],[Unused Ballots]]+Party1[[#This Row],[Soiled/ Defaced]]+Party1[[#This Row],[Provisional Ballots]])","v":0},{"$f":"ABS(Party1[[#This Row],[Difference]])","v":0}]
{"$rows_left_out":32}
{"sheet":"Republican","index":3,"n_rows":41,"n_cols":11,"rows_kept":41,"cut":false,"hidden":false,"merged":[[0,0,0,10],[1,7,1,9],[1,0,1,3],[1,5,1,6]]}
[{"$f":"\"Ballot Reconciliation - \" & MID(CELL(\"filename\",Party2[[#Headers],[City/Ward/Precinct]]),FIND(\"]\",CELL(\"filename\",Party2[[#Headers],[City/Ward/Precinct]]))+1,256)","v":"Ballot Reconciliation - Republican"}]
["User Editable Columns",null,null,null,"Calculated Columns","User Editable Columns",null,"Calculated Columns (Do Not Edit)",null,null,"User Editable Columns"]
["City/Ward/Precinct","Ballots Ordered","Ballots Used (Physically Counted)","Ballots Cast (from Tabulation System)","Unused Ballots","Soiled/ Defaced","Provisional Ballots","Reconciled?","Difference","Absolute Differences","Comments / Explanations"]
[null,null,null,null,{"$f":"B4-C4","v":0},null,null,{"$f":"IF(ISBLANK(Party2[[#This Row],[City/Ward/Precinct]]), \" - \", IF(Party2[[#This Row],[Difference]]=0,\"YES\",\"NO\"))","v":" - "},{"$f":"Party2[[#This Row],[Ballots Ordered]]-(Party2[[#This Row],[Ballots Cast (from Tabulation System)]]+Party2[[#This Row],[Unused Ballots]]+Party2[[#This Row],[Soiled/ Defaced]]+Party2[[#This Row],[Provisional Ballots]])","v":0},{"$f":"ABS(Party2[[#This Row],[Difference]])","v":0}]
[null,null,null,null,0,null,null,{"$f":"IF(ISBLANK(Party2[[#This Row],[City/Ward/Precinct]]), \" - \", IF(Party2[[#This Row],[Difference]]=0,\"YES\",\"NO\"))","v":" - "},{"$f":"Party2[[#This Row],[Ballots Ordered]]-(Party2[[#This Row],[Ballots Cast (from Tabulation System)]]+Party2[[#This Row],[Unused Ballots]]+Party2[[#This Row],[Soiled/ Defaced]]+Party2[[#This Row],[Provisional Ballots]])","v":0},{"$f":"ABS(Party2[[#This Row],[Difference]])","v":0}]
[null,null,null,null,0,null,null,{"$f":"IF(ISBLANK(Party2[[#This Row],[City/Ward/Precinct]]), \" - \", IF(Party2[[#This Row],[Difference]]=0,\"YES\",\"NO\"))","v":" - "},{"$f":"Party2[[#This Row],[Ballots Ordered]]-(Party2[[#This Row],[Ballots Cast (from Tabulation System)]]+Party2[[#This Row],[Unused Ballots]]+Party2[[#This Row],[Soiled/ Defaced]]+Party2[[#This Row],[Provisional Ballots]])","v":0},{"$f":"ABS(Party2[[#This Row],[Difference]])","v":0}]
[null,null,null,null,0,null,null,{"$f":"IF(ISBLANK(Party2[[#This Row],[City/Ward/Precinct]]), \" - \", IF(Party2[[#This Row],[Difference]]=0,\"YES\",\"NO\"))","v":" - "},{"$f":"Party2[[#This Row],[Ballots Ordered]]-(Party2[[#This Row],[Ballots Cast (from Tabulation System)]]+Party2[[#This Row],[Unused Ballots]]+Party2[[#This Row],[Soiled/ Defaced]]+Party2[[#This Row],[Provisional Ballots]])","v":0},{"$f":"ABS(Party2[[#This Row],[Difference]])","v":0}]
[null,null,null,null,0,null,null,{"$f":"IF(ISBLANK(Party2[[#This Row],[City/Ward/Precinct]]), \" - \", IF(Party2[[#This Row],[Difference]]=0,\"YES\",\"NO\"))","v":" - "},{"$f":"Party2[[#This Row],[Ballots Ordered]]-(Party2[[#This Row],[Ballots Cast (from Tabulation System)]]+Party2[[#This Row],[Unused Ballots]]+Party2[[#This Row],[Soiled/ Defaced]]+Party2[[#This Row],[Provisional Ballots]])","v":0},{"$f":"ABS(Party2[[#This Row],[Difference]])","v":0}]
[null,null,null,null,0,null,null,{"$f":"IF(ISBLANK(Party2[[#This Row],[City/Ward/Precinct]]), \" - \", IF(Party2[[#This Row],[Difference]]=0,\"YES\",\"NO\"))","v":" - "},{"$f":"Party2[[#This Row],[Ballots Ordered]]-(Party2[[#This Row],[Ballots Cast (from Tabulation System)]]+Party2[[#This Row],[Unused Ballots]]+Party2[[#This Row],[Soiled/ Defaced]]+Party2[[#This Row],[Provisional Ballots]])","v":0},{"$f":"ABS(Party2[[#This Row],[Difference]])","v":0}]
[null,null,null,null,0,null,null,{"$f":"IF(ISBLANK(Party2[[#This Row],[City/Ward/Precinct]]), \" - \", IF(Party2[[#This Row],[Difference]]=0,\"YES\",\"NO\"))","v":" - "},{"$f":"Party2[[#This Row],[Ballots Ordered]]-(Party2[[#This Row],[Ballots Cast (from Tabulation System)]]+Party2[[#This Row],[Unused Ballots]]+Party2[[#This Row],[Soiled/ Defaced]]+Party2[[#This Row],[Provisional Ballots]])","v":0},{"$f":"ABS(Party2[[#This Row],[Difference]])","v":0}]
{"$rows_left_out":32}
{"sheet":"Nonpartisan","index":4,"n_rows":41,"n_cols":11,"rows_kept":41,"cut":false,"hidden":false,"merged":[[0,0,0,10],[1,7,1,9],[1,0,1,3],[1,5,1,6]]}
[{"$f":"\"Ballot Reconciliation - \" & MID(CELL(\"filename\",Party3[[#Headers],[City/Ward/Precinct]]),FIND(\"]\",CELL(\"filename\",Party3[[#Headers],[City/Ward/Precinct]]))+1,256)","v":"Ballot Reconciliation - Nonpartisan"}]
["User Editable Columns",null,null,null,"Calculated Columns","User Editable Columns",null,"Calculated Columns (Do Not Edit)",null,null,"User Editable Columns"]
["City/Ward/Precinct","Ballots Ordered","Ballots Used (Physically Counted)","Ballots Cast (from Tabulation System)","Unused Ballots","Soiled/ Defaced","Provisional Ballots","Reconciled?","Difference","Absolute Differences","Comments / Explanations"]
[null,null,null,null,{"$f":"B4-C4","v":0},null,null,{"$f":"IF(ISBLANK(Party3[[#This Row],[City/Ward/Precinct]]), \" - \", IF(Party3[[#This Row],[Difference]]=0,\"YES\",\"NO\"))","v":" - "},{"$f":"Party3[[#This Row],[Ballots Ordered]]-(Party3[[#This Row],[Ballots Cast (from Tabulation System)]]+Party3[[#This Row],[Unused Ballots]]+Party3[[#This Row],[Soiled/ Defaced]]+Party3[[#This Row],[Provisional Ballots]])","v":0},{"$f":"ABS(Party3[[#This Row],[Difference]])","v":0}]
[null,null,null,null,{"$f":"B5-C5","v":0},null,null,{"$f":"IF(ISBLANK(Party3[[#This Row],[City/Ward/Precinct]]), \" - \", IF(Party3[[#This Row],[Difference]]=0,\"YES\",\"NO\"))","v":" - "},{"$f":"Party3[[#This Row],[Ballots Ordered]]-(Party3[[#This Row],[Ballots Cast (from Tabulation System)]]+Party3[[#This Row],[Unused Ballots]]+Party3[[#This Row],[Soiled/ Defaced]]+Party3[[#This Row],[Provisional Ballots]])","v":0},{"$f":"ABS(Party3[[#This Row],[Difference]])","v":0}]
[null,null,null,null,0,null,null,{"$f":"IF(ISBLANK(Party3[[#This Row],[City/Ward/Precinct]]), \" - \", IF(Party3[[#This Row],[Difference]]=0,\"YES\",\"NO\"))","v":" - "},{"$f":"Party3[[#This Row],[Ballots Ordered]]-(Party3[[#This Row],[Ballots Cast (from Tabulation System)]]+Party3[[#This Row],[Unused Ballots]]+Party3[[#This Row],[Soiled/ Defaced]]+Party3[[#This Row],[Provisional Ballots]])","v":0},{"$f":"ABS(Party3[[#This Row],[Difference]])","v":0}]
[null,null,null,null,0,null,null,{"$f":"IF(ISBLANK(Party3[[#This Row],[City/Ward/Precinct]]), \" - \", IF(Party3[[#This Row],[Difference]]=0,\"YES\",\"NO\"))","v":" - "},{"$f":"Party3[[#This Row],[Ballots Ordered]]-(Party3[[#This Row],[Ballots Cast (from Tabulation System)]]+Party3[[#This Row],[Unused Ballots]]+Party3[[#This Row],[Soiled/ Defaced]]+Party3[[#This Row],[Provisional Ballots]])","v":0},{"$f":"ABS(Party3[[#This Row],[Difference]])","v":0}]
[null,null,null,null,0,null,null,{"$f":"IF(ISBLANK(Party3[[#This Row],[City/Ward/Precinct]]), \" - \", IF(Party3[[#This Row],[Difference]]=0,\"YES\",\"NO\"))","v":" - "},{"$f":"Party3[[#This Row],[Ballots Ordered]]-(Party3[[#This Row],[Ballots Cast (from Tabulation System)]]+Party3[[#This Row],[Unused Ballots]]+Party3[[#This Row],[Soiled/ Defaced]]+Party3[[#This Row],[Provisional Ballots]])","v":0},{"$f":"ABS(Party3[[#This Row],[Difference]])","v":0}]
[null,null,null,null,0,null,null,{"$f":"IF(ISBLANK(Party3[[#This Row],[City/Ward/Precinct]]), \" - \", IF(Party3[[#This Row],[Difference]]=0,\"YES\",\"NO\"))","v":" - "},{"$f":"Party3[[#This Row],[Ballots Ordered]]-(Party3[[#This Row],[Ballots Cast (from Tabulation System)]]+Party3[[#This Row],[Unused Ballots]]+Party3[[#This Row],[Soiled/ Defaced]]+Party3[[#This Row],[Provisional Ballots]])","v":0},{"$f":"ABS(Party3[[#This Row],[Difference]])","v":0}]
[null,null,null,null,0,null,null,{"$f":"IF(ISBLANK(Party3[[#This Row],[City/Ward/Precinct]]), \" - \", IF(Party3[[#This Row],[Difference]]=0,\"YES\",\"NO\"))","v":" - "},{"$f":"Party3[[#This Row],[Ballots Ordered]]-(Party3[[#This Row],[Ballots Cast (from Tabulation System)]]+Party3[[#This Row],[Unused Ballots]]+Party3[[#This Row],[Soiled/ Defaced]]+Party3[[#This Row],[Provisional Ballots]])","v":0},{"$f":"ABS(Party3[[#This Row],[Difference]])","v":0}]
{"$rows_left_out":32}
{"sheet":"Instructions","index":5,"n_rows":62,"n_cols":3,"rows_kept":62,"cut":false,"hidden":false,"merged":[[44,1,44,2],[21,1,21,2],[0,0,0,2],[1,0,1,2],[2,0,2,2],[3,0,3,2],[4,0,4,2],[6,1,6,2],[12,0,19,0],[12,1,12,2],[21,0,25,0],[26,0,34,0],[5,1,5,2],[11,1,11,2],[53,0,56,0],[53,1,53,2],[57,0,61,0],[57,1,57,2],[26,1,26,2],[48,0,52,0],[48,1,48,2],[35,0,36,0],[35,1,35,2],[36,1,36,2],[37,1,37,2],[38,0,38,2],[39,0,39,2],[40,0,43,0],[40,1,40,2],[44,0,47,0]]}
[{"$f":"MID(CELL(\"filename\",$A$2), FIND(\"]\", CELL(\"filename\",$A$2)) + 1, 255)","v":"Instructions"}]
["Note: The columns that can be safely edited are marked in the header as \"User Editable Columns\" and are shaded in a lighter blue."]
["Note: Do not remove/overwrite the header rows or the total row."]
["Note: Paste data as values only (see item S1 below)."]
["Note: Many columns contain calculation fields and are hidden from view."]
[1,"Save a new copy to work from using the 'Save As' option in the menu. Do not modify the original \nspreadsheet."]
[2,"If a Security Warning appears, macros must be enabled."]
[null,null,"Note: This spreadsheet will not work if macros are not enabled."]
[null,"a.","Excel may state \"Macros have been disabled.\""]
[null,"b.","Click \"Options…\""]
{"$rows_left_out":52}